Orchestra
type: Ensemble
type: Uitvoeringsmedium
type: Concept
creator: pknet
publisher: pknet
created: pknet |D 2022 12 14 |T 00:00:00
modified: 3ERIC |D 2022 12 23 |T 10:33:24
modified: 3ERIC |D 2022 12 23 |T 11:17:37
keywords: 3ERIC |D 2022 12 23 |T 10:33:24 3ERIC |D 2022 12 23 |T 11:17:37 Ensemble Gebruik als generieke term voor alle meervoudig bezette instrumentale ensembles Orchester Orchestra Orchestre Orquesta Uitvoeringsmedium https://data.muziekschatten.nl/som/d7842 https://www.iflastandards.info/unimarc/terms/mop#o orkest pknet pknet |D 2022 12 14 |T 00:00:00 topConcept um2053
in scheme: Uitvoeringsmedium
preferred label: Orchestre @fr
preferred label: Orchester @de
preferred label: orkest @nl
preferred label: Orquesta @es
scope note: Gebruik als generieke term voor alle meervoudig bezette instrumentale ensembles
top concept of: topConcept
top concept of: Uitvoeringsmedium
DEPTMD: Orchester
ENPTMD: Orchestra
ESPTMD: Orquesta
FRPTMD: Orchestre
IFLAL: https://www.iflastandards.info/unimarc/terms/mop#o
ITPTMD: Orchestra
MSIDL: https://data.muziekschatten.nl/som/d7842
NDEREC: um2053
NLPTMD: orkest
SCOPEN: Gebruik als generieke term voor alle meervoudig bezette instrumentale ensembles
STAMP: pknet |D 2022 12 14 |T 00:00:00
SXCLS: Ensemble
SXHIS: 3ERIC |D 2022 12 23 |T 11:17:37
SXHIS: 3ERIC |D 2022 12 23 |T 10:33:24
SXSCH: Uitvoeringsmedium
TOPCT: topConcept
WHO: pknet
WHOOR: pknet