Orchestra
ITPTMD: Orchestra
created: pknet |D 2022 12 14 |T 00:00:00
preferred label: Orchestre @fr
SXHIS: 3ERIC |D 2022 12 23 |T 11:17:37
MSIDL: https://data.muziekschatten.nl/som/d7842
type: Ensemble
NLPTMD: orkest
preferred label: Orchester @de
top concept of: topConcept
top concept of: Uitvoeringsmedium
WHO: pknet
SXCLS: Ensemble
creator: pknet
preferred label: orkest @nl
type: Uitvoeringsmedium
FRPTMD: Orchestre
NDEREC: um2053
preferred label: Orquesta @es
type: Concept
IFLAL: https://www.iflastandards.info/unimarc/terms/mop#o
scope note: Gebruik als generieke term voor alle meervoudig bezette instrumentale ensembles
modified: 3ERIC |D 2022 12 23 |T 10:33:24
WHOOR: pknet
ENPTMD: Orchestra
TOPCT: topConcept
ESPTMD: Orquesta
SCOPEN: Gebruik als generieke term voor alle meervoudig bezette instrumentale ensembles
SXSCH: Uitvoeringsmedium
SXHIS: 3ERIC |D 2022 12 23 |T 10:33:24
publisher: pknet
in scheme: Uitvoeringsmedium
modified: 3ERIC |D 2022 12 23 |T 11:17:37
keywords: 3ERIC |D 2022 12 23 |T 10:33:24 3ERIC |D 2022 12 23 |T 11:17:37 Ensemble Gebruik als generieke term voor alle meervoudig bezette instrumentale ensembles Orchester Orchestra Orchestre Orquesta Uitvoeringsmedium https://data.muziekschatten.nl/som/d7842 https://www.iflastandards.info/unimarc/terms/mop#o orkest pknet pknet |D 2022 12 14 |T 00:00:00 topConcept um2053
DEPTMD: Orchester
STAMP: pknet |D 2022 12 14 |T 00:00:00